Reaction Details
Target11-beta-hydroxysteroid dehydrogenase 1
LigandBDBM50399335
Substrate/Competitorn/a
Meas. Tech.ChEMBL_877632 (CHEMBL2184996)
IC50 9±n/a nM
Citation Scott, JSdeSchoolmeester, JKilgour, EMayers, RMPacker, MJHargreaves, DGerhardt, SOgg, DJRees, ASelmi, NStocker, ASwales, JGWhittamore, PR Novel acidic 11ß-hydroxysteroid dehydrogenase type 1 (11ß-HSD1) inhibitor with reduced acyl glucuronide liability: the discovery of 4-[4-(2-adamantylcarbamoyl)-5-tert-butyl-pyrazol-1-yl]benzoic acid (AZD8329). J Med Chem55:10136-47 (2012) 
 
11-beta-hydroxysteroid dehydrogenase 1
Name:11-beta-hydroxysteroid dehydrogenase 1
Type:Enzyme
Mol. Mass.:32409.16
Organism:Homo sapiens (Human)
Description:P28845
Residue:292
BDBM50399335
NameBDBM50399335
Synonyms:CHEMBL2177609
TypeSmall organic molecule
Emp. Form.C25H31N3O3
Mol. Mass.421.5319
SMILESCC(C)(C)c1c(cnn1-c1ccc(cc1)C(O)=O)C(=O)NC1C2CC3CC(C2)CC1C3