Reaction Details
TargetMacrophage mannose receptor 1
LigandBDBM50399361
Substrate/Competitorn/a
Meas. Tech.ChEMBL_877650 (CHEMBL2185429)
IC50 1000000±n/a nM
Citation Scharenberg, MSchwardt, ORabbani, SErnst, B Target Selectivity of FimH Antagonists. J Med Chem55:9810-6 (2012) 
 
Macrophage mannose receptor 1
Name:Macrophage mannose receptor 1
Type:PROTEIN
Mol. Mass.:166009.70
Organism:Homo sapiens (Human)
Description:ChEMBL_877650
Residue:1456
BDBM50399361
NameBDBM50399361
Synonyms:CHEMBL2079375
TypeSmall organic molecule
Emp. Form.C21H20ClNO8
Mol. Mass.449.838
SMILESOC[C@H]1O[C@H](Oc2ccc(cc2Cl)-n2ccc3cc(ccc23)C(O)=O)[C@@H](O)[C@@H](O)[C@@H]1O