Reaction Details
TargetNeuronal acetylcholine receptor subunit alpha-7
LigandBDBM50049750
Substrate/Competitorn/a
Meas. Tech.ChEMBL_877931 (CHEMBL2188607)
Ki 148±n/a nM
Citation Yu, LFEaton, JBFedolak, AZhang, HKHanania, TBrunner, DLukas, RJKozikowski, AP Discovery of highly potent and selectivea4ß2-nicotinic acetylcholine receptor (nAChR) partial agonists containing an isoxazolylpyridine ether scaffold that demonstrate antidepressant-like activity. Part II. J Med Chem55:9998-10009 (2012) 
 
Neuronal acetylcholine receptor subunit alpha-7
Name:Neuronal acetylcholine receptor subunit alpha-7
Type:n/a
Mol. Mass.:56448.33
Organism:Homo sapiens (Human)
Description: CHRNA7 (NACHRA7)
Residue:502
BDBM50049750
NameBDBM50049750
Synonyms:(S)-3-(azetidin-2-ylmethoxy)pyridine A-159470 CHEMBL59986
TypeSmall organic molecule
Emp. Form.C9H12N2O
Mol. Mass.164.2044
SMILESC(Oc1cccnc1)[C@@H]1CCN1