Reaction Details
TargetTyrosine-protein kinase ITK/TSK
LigandBDBM50399459
Substrate/Competitorn/a
Meas. Tech.ChEMBL_878241 (CHEMBL2185029)
IC50 2±n/a nM
Citation Zapf, CWGerstenberger, BSXing, LLimburg, DCAnderson, DRCaspers, NHan, SAulabaugh, AKurumbail, RShakya, SLi, XSpaulding, VCzerwinski, RMSeth, NMedley, QG Covalent inhibitors of interleukin-2 inducible T cell kinase (itk) with nanomolar potency in a whole-blood assay. J Med Chem55:10047-63 (2012) 
 
Tyrosine-protein kinase ITK/TSK
Name:Tyrosine-protein kinase ITK/TSK
Type:Protein
Mol. Mass.:71839.20
Organism:Homo sapiens (Human)
Description:Q08881
Residue:620
BDBM50399459
NameBDBM50399459
Synonyms:CHEMBL2179805
TypeSmall organic molecule
Emp. Form.C30H33N7O2
Mol. Mass.523.6287
SMILESCC(C)c1ccc(NC(=O)c2cccc(c2)-c2nn([C@@H]3CCCN(C3)C(=O)C=C)c3ncnc(N)c23)cc1C