Reaction Details
TargetCannabinoid receptor 2
LigandBDBM50383388
Substrate/Competitorn/a
Meas. Tech.ChEMBL_878264 (CHEMBL2185469)
Ki 5504±n/a nM
Citation Fulp, ABortoff, KZhang, YSeltzman, HMathews, JSnyder, RFennell, TMaitra, R Diphenyl purine derivatives as peripherally selective cannabinoid receptor 1 antagonists. J Med Chem55:10022-32 (2012) 
 
Cannabinoid receptor 2
Name:Cannabinoid receptor 2
Type:G Protein-Coupled Receptor (GPCR)
Mol. Mass.:39690.94
Organism:Homo sapiens (Human)
Description:P34972
Residue:360
BDBM50383388
NameBDBM50383388
Synonyms:CHEMBL2030738
TypeSmall organic molecule
Emp. Form.C29H25Cl3N4O2
Mol. Mass.567.893
SMILESCc1c(nn(c1-c1ccc(Cl)cc1)-c1ccc(Cl)cc1Cl)C(=O)N1CCC(CC1)(C(N)=O)c1ccccc1