Reaction Details
TargetCannabinoid receptor 1
LigandBDBM50399518
Substrate/Competitorn/a
Meas. Tech.ChEMBL_878265 (CHEMBL2185470)
Ki 1.2±n/a nM
Citation Fulp, ABortoff, KZhang, YSeltzman, HMathews, JSnyder, RFennell, TMaitra, R Diphenyl purine derivatives as peripherally selective cannabinoid receptor 1 antagonists. J Med Chem55:10022-32 (2012) 
 
Cannabinoid receptor 1
Name:Cannabinoid receptor 1
Type:G Protein-Coupled Receptor (GPCR)
Mol. Mass.:52868.96
Organism:Homo sapiens (Human)
Description:P21554
Residue:472
BDBM50399518
NameBDBM50399518
Synonyms:CHEMBL2180214
TypeSmall organic molecule
Emp. Form.C28H24Cl2N6O2S
Mol. Mass.579.5
SMILESClc1ccc(cc1)-n1c(nc2c(ncnc12)N1CCC(CC1)NS(=O)(=O)c1ccccc1)-c1ccccc1Cl