Reaction Details
TargetCannabinoid receptor 1
LigandBDBM50399523
Substrate/Competitorn/a
Meas. Tech.ChEMBL_878265 (CHEMBL2185470)
Ki 1.5±n/a nM
Citation Fulp, ABortoff, KZhang, YSeltzman, HMathews, JSnyder, RFennell, TMaitra, R Diphenyl purine derivatives as peripherally selective cannabinoid receptor 1 antagonists. J Med Chem55:10022-32 (2012) 
 
Cannabinoid receptor 1
Name:Cannabinoid receptor 1
Type:G Protein-Coupled Receptor (GPCR)
Mol. Mass.:52868.96
Organism:Homo sapiens (Human)
Description:P21554
Residue:472
BDBM50399523
NameBDBM50399523
Synonyms:CHEMBL2180205
TypeSmall organic molecule
Emp. Form.C27H28Cl2N6O2
Mol. Mass.539.456
SMILESCC(C)(C)OC(=O)NC1CCN(CC1)c1ncnc2n(c(nc12)-c1ccccc1Cl)-c1ccc(Cl)cc1