Reaction Details
TargetCannabinoid receptor 1
LigandBDBM50399524
Substrate/Competitorn/a
Meas. Tech.ChEMBL_878265 (CHEMBL2185470)
Ki 3343±n/a nM
Citation Fulp, ABortoff, KZhang, YSeltzman, HMathews, JSnyder, RFennell, TMaitra, R Diphenyl purine derivatives as peripherally selective cannabinoid receptor 1 antagonists. J Med Chem55:10022-32 (2012) 
 
Cannabinoid receptor 1
Name:Cannabinoid receptor 1
Type:G Protein-Coupled Receptor (GPCR)
Mol. Mass.:52868.96
Organism:Homo sapiens (Human)
Description:P21554
Residue:472
BDBM50399524
NameBDBM50399524
Synonyms:CHEMBL2180231
TypeSmall organic molecule
Emp. Form.C27H29Cl2N7O
Mol. Mass.538.471
SMILESCCCCNC(=O)N1CCC(CC1)Nc1ncnc2n(c(nc12)-c1ccccc1Cl)-c1ccc(Cl)cc1