Reaction Details
TargetCannabinoid receptor 1
LigandBDBM50399530
Substrate/Competitorn/a
Meas. Tech.ChEMBL_878265 (CHEMBL2185470)
Ki 25.5±n/a nM
Citation Fulp, ABortoff, KZhang, YSeltzman, HMathews, JSnyder, RFennell, TMaitra, R Diphenyl purine derivatives as peripherally selective cannabinoid receptor 1 antagonists. J Med Chem55:10022-32 (2012) 
 
Cannabinoid receptor 1
Name:Cannabinoid receptor 1
Type:G Protein-Coupled Receptor (GPCR)
Mol. Mass.:52868.96
Organism:Homo sapiens (Human)
Description:P21554
Residue:472
BDBM50399530
NameBDBM50399530
Synonyms:CHEMBL2180219 | US9187480, 3-tert-butyl-1-{1-[8-(2-chlorophenyl)-9-(4-chlorophenyl)-9H-purin-6-yl]-4-phenylpiperidin-4-yl}urea
TypeSmall organic molecule
Emp. Form.C33H33Cl2N7O
Mol. Mass.614.567
SMILESCC(C)(C)NC(=O)NC1(CCN(CC1)c1ncnc2n(c(nc12)-c1ccccc1Cl)-c1ccc(Cl)cc1)c1ccccc1