Reaction Details
TargetVascular endothelial growth factor receptor 2
LigandBDBM26105
Substrate/Competitorn/a
Meas. Tech.ChEMBL_878375 (CHEMBL2186468)
IC50 77±n/a nM
Citation Musumeci, FRadi, MBrullo, CSchenone, S Vascular endothelial growth factor (VEGF) receptors: drugs and new inhibitors. J Med Chem55:10797-822 (2012) 
 
Vascular endothelial growth factor receptor 2
Name:Vascular endothelial growth factor receptor 2
Type:Receptor Tyrosine Kinase
Mol. Mass.:151510.97
Organism:Homo sapiens (Human)
Description:P35968
Residue:1356
BDBM26105
NameBDBM26105
Synonyms:6-{4-[(4-ethylpiperazin-1-yl)methyl]phenyl}-N-[(1R)-1-phenylethyl]-7H-pyrrolo[2,3-d]pyrimidin-4-amine | AEE788
TypeSmall organic molecule
Emp. Form.C27H32N6
Mol. Mass.440.5832
SMILESCCN1CCN(Cc2ccc(cc2)-c2cc3c(N[C@H](C)c4ccccc4)ncnc3[nH]2)CC1