Reaction Details
TargetVascular endothelial growth factor receptor 3
LigandBDBM50399538
Substrate/Competitorn/a
Meas. Tech.ChEMBL_878374 (CHEMBL2186467)
IC50 4±n/a nM
Citation Musumeci, FRadi, MBrullo, CSchenone, S Vascular endothelial growth factor (VEGF) receptors: drugs and new inhibitors. J Med Chem55:10797-822 (2012) 
 
Vascular endothelial growth factor receptor 3
Name:Vascular endothelial growth factor receptor 3
Type:Protein
Mol. Mass.:152749.58
Organism:Homo sapiens (Human)
Description:P35916-2
Residue:1363
BDBM50399538
NameBDBM50399538
Synonyms:BAY-579352 | CHEMBL2079588
TypeSmall organic molecule
Emp. Form.C20H16ClN5O3
Mol. Mass.409.826
SMILESCNC(=O)c1cc(COc2nnc(Nc3ccc(Cl)cc3)c3ccoc23)ccn1