Reaction Details
TargetVascular endothelial growth factor receptor 2
LigandBDBM50331095
Substrate/Competitorn/a
Meas. Tech.ChEMBL_878375 (CHEMBL2186468)
IC50 0.16±n/a nM
Citation Musumeci, FRadi, MBrullo, CSchenone, S Vascular endothelial growth factor (VEGF) receptors: drugs and new inhibitors. J Med Chem55:10797-822 (2012) 
 
Vascular endothelial growth factor receptor 2
Name:Vascular endothelial growth factor receptor 2
Type:Receptor Tyrosine Kinase
Mol. Mass.:151510.97
Organism:Homo sapiens (Human)
Description:P35968
Residue:1356
BDBM50331095
NameBDBM50331095
Synonyms:CHEMBL1289494 US10464902, Tivozanib
TypeSmall organic molecule
Emp. Form.C22H19ClN4O5
Mol. Mass.454.863
SMILESCOc1cc2nccc(Oc3ccc(NC(=O)Nc4cc(C)on4)c(Cl)c3)c2cc1OC