Reaction Details
TargetVoltage-dependent L-type calcium channel subunit alpha-1C
LigandBDBM50399541
Substrate/Competitorn/a
Meas. Tech.ChEMBL_878506 (CHEMBL2187791)
IC50 3200±n/a nM
Citation Shao, PPYe, FChakravarty, PKVarughese, DJHerrington, JBDai, GBugianesi, RMHaedo, RJSwensen, AMWarren, VASmith, MMGarcia, MLMcManus, OBLyons, KALi, XGreen, MJochnowitz, NMcGowan, EMistry, SSun, SYAbbadie, CKaczorowski, GJDuffy, JL Aminopiperidine sulfonamide Cav2.2 channel inhibitors for the treatment of chronic pain. J Med Chem55:9847-55 (2012) 
 
Voltage-dependent L-type calcium channel subunit alpha-1C
Name:Voltage-dependent L-type calcium channel subunit alpha-1C
Type:Enzyme Catalytic Domain
Mol. Mass.:248979.79
Organism:Homo sapiens (Human)
Description:Calcium channel (Type L) 0 HUMAN::Q13936
Residue:2221
BDBM50399541
NameBDBM50399541
Synonyms:CHEMBL2180891
TypeSmall organic molecule
Emp. Form.C24H31F3N2O4S
Mol. Mass.500.574
SMILESCCCN(C1CCN(Cc2c(OC)cccc2OC)CC1)S(=O)(=O)c1cccc(c1)C(F)(F)F