Reaction Details
TargetVoltage-dependent N-type calcium channel subunit alpha-1B
LigandBDBM50399543
Substrate/Competitorn/a
Meas. Tech.ChEMBL_878508 (CHEMBL2187793)
IC50 2500±n/a nM
Citation Shao, PPYe, FChakravarty, PKVarughese, DJHerrington, JBDai, GBugianesi, RMHaedo, RJSwensen, AMWarren, VASmith, MMGarcia, MLMcManus, OBLyons, KALi, XGreen, MJochnowitz, NMcGowan, EMistry, SSun, SYAbbadie, CKaczorowski, GJDuffy, JL Aminopiperidine sulfonamide Cav2.2 channel inhibitors for the treatment of chronic pain. J Med Chem55:9847-55 (2012) 
 
Voltage-dependent N-type calcium channel subunit alpha-1B
Name:Voltage-dependent N-type calcium channel subunit alpha-1B
Type:Enzyme
Mol. Mass.:262548.16
Organism:Homo sapiens (Human)
Description:Q00975
Residue:2339
BDBM50399543
NameBDBM50399543
Synonyms:CHEMBL2180887
TypeSmall organic molecule
Emp. Form.C23H23F5N2O5S2
Mol. Mass.566.561
SMILESCS(=O)(=O)c1ccc(F)cc1C(=O)N1CCC(CC1)N(C1CC1)S(=O)(=O)c1cc(ccc1F)C(F)(F)F