Reaction Details
TargetDelta-type opioid receptor
LigandBDBM50399634
Substrate/Competitorn/a
Meas. Tech.ChEMBL_878565 (CHEMBL2188650)
IC50 1.16±n/a nM
Citation Novoa, AVan Dorpe, SWynendaele, ESpetea, MBracke, NStalmans, SBetti, CChung, NNLemieux, CZuegg, JCooper, MATourwé, DDe Spiegeleer, BSchiller, PWBallet, S Variation of the net charge, lipophilicity, and side chain flexibility in Dmt(1)-DALDA: Effect on Opioid Activity and Biodistribution. J Med Chem55:9549-61 (2012) 
 
Delta-type opioid receptor
Name:Delta-type opioid receptor
Type:Enzyme Catalytic Domain
Mol. Mass.:40577.25
Organism:MOUSE
Description:P32300
Residue:372
BDBM50399634
NameBDBM50399634
Synonyms:CHEMBL2181191
TypeSmall organic molecule
Emp. Form.C33H47N7O6
Mol. Mass.637.7696
SMILESCCCC[C@H](N1Cc2ccccc2C[C@H](NC(=O)[C@@H](CCCNC(N)=O)NC(=O)[C@@H](N)Cc2c(C)cc(O)cc2C)C1=O)C(N)=O