Reaction Details
TargetMu-type opioid receptor
LigandBDBM50399638
Substrate/Competitorn/a
Meas. Tech.ChEMBL_878566 (CHEMBL2188651)
IC50 1.01±n/a nM
Citation Novoa, AVan Dorpe, SWynendaele, ESpetea, MBracke, NStalmans, SBetti, CChung, NNLemieux, CZuegg, JCooper, MATourwé, DDe Spiegeleer, BSchiller, PWBallet, S Variation of the net charge, lipophilicity, and side chain flexibility in Dmt(1)-DALDA: Effect on Opioid Activity and Biodistribution. J Med Chem55:9549-61 (2012) 
 
Mu-type opioid receptor
Name:Mu-type opioid receptor
Type:Enzyme Catalytic Domain
Mol. Mass.:11165.58
Organism:GUINEA PIG
Description:P97266
Residue:98
BDBM50399638
NameBDBM50399638
Synonyms:CHEMBL2181196
TypeSmall organic molecule
Emp. Form.C33H50N8O6
Mol. Mass.654.8001
SMILESCN([C@@H](CCCCN)C(N)=O)C(=O)[C@H](Cc1ccccc1)NC(=O)[C@@H](CCCNC(N)=O)NC(=O)[C@@H](N)Cc1c(C)cc(O)cc1C