Reaction Details
TargetMu-type opioid receptor
LigandBDBM50399640
Substrate/Competitorn/a
Meas. Tech.ChEMBL_878566 (CHEMBL2188651)
IC50 8.3±n/a nM
Citation Novoa, AVan Dorpe, SWynendaele, ESpetea, MBracke, NStalmans, SBetti, CChung, NNLemieux, CZuegg, JCooper, MATourwé, DDe Spiegeleer, BSchiller, PWBallet, S Variation of the net charge, lipophilicity, and side chain flexibility in Dmt(1)-DALDA: Effect on Opioid Activity and Biodistribution. J Med Chem55:9549-61 (2012) 
 
Mu-type opioid receptor
Name:Mu-type opioid receptor
Type:Enzyme Catalytic Domain
Mol. Mass.:11165.58
Organism:GUINEA PIG
Description:P97266
Residue:98
BDBM50399640
NameBDBM50399640
Synonyms:CHEMBL2181198
TypeSmall organic molecule
Emp. Form.C33H51N9O5
Mol. Mass.653.8153
SMILES[#6]-[#7](-[#6@@H](-[#6]-[#6]-[#6]-[#6]-[#7])-[#6](-[#7])=O)-[#6](=O)-[#6@H](-[#6]-c1ccccc1)-[#7]-[#6](=O)-[#6@@H](-[#6]-[#6]-[#6]\[#7]=[#6](/[#7])-[#7])-[#7]-[#6](=O)-[#6@@H](-[#7])-[#6]-c1c(-[#6])cc(-[#8])cc1-[#6]