Reaction Details
TargetKappa-type opioid receptor
LigandBDBM50346330
Substrate/Competitorn/a
Meas. Tech.ChEMBL_878637 (CHEMBL2189107)
Ki 118±n/a nM
Citation Novoa, AVan Dorpe, SWynendaele, ESpetea, MBracke, NStalmans, SBetti, CChung, NNLemieux, CZuegg, JCooper, MATourwé, DDe Spiegeleer, BSchiller, PWBallet, S Variation of the net charge, lipophilicity, and side chain flexibility in Dmt(1)-DALDA: Effect on Opioid Activity and Biodistribution. J Med Chem55:9549-61 (2012) 
 
Kappa-type opioid receptor
Name:Kappa-type opioid receptor
Type:G Protein-Coupled Receptor (GPCR)
Mol. Mass.:42744.99
Organism:Cavia porcellus (domestic guinea pig)
Description:P41144
Residue:380
BDBM50346330
NameBDBM50346330
Synonyms:(R)-N-((S)-2-(2-amino-2-oxoethyl)-3-oxo-2,3,4,5-tetrahydro-1H-benzo[c]azepin-4-yl)-2-((S)-2-amino-3-(4-hydroxy-2,6-dimethylphenyl)propanamido)-5-guanidinopentanamide | CHEMBL1782140
TypeSmall organic molecule
Emp. Form.C29H40N8O5
Mol. Mass.580.6785
SMILES[#6]-c1cc(-[#8])cc(-[#6])c1-[#6]-[#6@H](-[#7])-[#6](=O)-[#7]-[#6@H](-[#6]-[#6]-[#6]\[#7]=[#6](\[#7])-[#7])-[#6](=O)-[#7]-[#6@H]-1-[#6]-c2ccccc2-[#6]-[#7](-[#6]-[#6](-[#7])=O)-[#6]-1=O