Reaction Details
TargetMu-type opioid receptor
LigandBDBM50352123
Substrate/Competitorn/a
Meas. Tech.ChEMBL_878883 (CHEMBL2184596)
Ki 0.870000±n/a nM
Citation Yuan, YElbegdorj, OChen, JAkubathini, SKZhang, FStevens, DLBeletskaya, IOScoggins, KLZhang, ZGerk, PMSelley, DEAkbarali, HIDewey, WLZhang, Y Design, synthesis, and biological evaluation of 17-cyclopropylmethyl-3,14ß-dihydroxy-4,5a-epoxy-6ß-[(4'-pyridyl)carboxamido]morphinan derivatives as peripheral selectiveµ opioid receptor Agents. J Med Chem55:10118-29 (2012) 
 
Mu-type opioid receptor
Name:Mu-type opioid receptor
Type:G Protein-Coupled Receptor (GPCR)
Mol. Mass.:44789.51
Organism:Homo sapiens (Human)
Description:P35372
Residue:400
BDBM50352123
NameBDBM50352123
Synonyms:CHEMBL1824518 | CHEMBL1852475
TypeSmall organic molecule
Emp. Form.C27H37N3O4
Mol. Mass.467.6004
SMILESCN1CCC(CC1)C(=O)N[C@@H]1CC[C@@]2(O)[C@H]3Cc4ccc(O)c5O[C@@H]1[C@]2(CCN3CC1CC1)c45