Reaction Details
TargetDelta-type opioid receptor
LigandBDBM50352116
Substrate/Competitorn/a
Meas. Tech.ChEMBL_878882 (CHEMBL2184595)
Ki 90±n/a nM
Citation Yuan, YElbegdorj, OChen, JAkubathini, SKZhang, FStevens, DLBeletskaya, IOScoggins, KLZhang, ZGerk, PMSelley, DEAkbarali, HIDewey, WLZhang, Y Design, synthesis, and biological evaluation of 17-cyclopropylmethyl-3,14ß-dihydroxy-4,5a-epoxy-6ß-[(4'-pyridyl)carboxamido]morphinan derivatives as peripheral selectiveµ opioid receptor Agents. J Med Chem55:10118-29 (2012) 
 
Delta-type opioid receptor
Name:Delta-type opioid receptor
Type:G Protein-Coupled Receptor (GPCR)
Mol. Mass.:40382.98
Organism:Homo sapiens (Human)
Description:Competition binding assays were carried out using membrane preparations from transfected HN9.10 cells that constitutively expressed the delta opioid receptor.
Residue:372
BDBM50352116
NameBDBM50352116
Synonyms:CHEMBL1824512 | CHEMBL1852558
TypeSmall organic molecule
Emp. Form.C27H31N3O4
Mol. Mass.461.5527
SMILESCc1cc(ccn1)C(=O)N[C@@H]1CC[C@@]2(O)[C@H]3Cc4ccc(O)c5O[C@@H]1[C@]2(CCN3CC1CC1)c45