Reaction Details
TargetMu-type opioid receptor
LigandBDBM50399662
Substrate/Competitorn/a
Meas. Tech.ChEMBL_878878 (CHEMBL2184591)
EC50 7.9±n/a nM
Citation Yuan, YElbegdorj, OChen, JAkubathini, SKZhang, FStevens, DLBeletskaya, IOScoggins, KLZhang, ZGerk, PMSelley, DEAkbarali, HIDewey, WLZhang, Y Design, synthesis, and biological evaluation of 17-cyclopropylmethyl-3,14ß-dihydroxy-4,5a-epoxy-6ß-[(4'-pyridyl)carboxamido]morphinan derivatives as peripheral selectiveµ opioid receptor Agents. J Med Chem55:10118-29 (2012) 
 
Mu-type opioid receptor
Name:Mu-type opioid receptor
Type:G Protein-Coupled Receptor (GPCR)
Mol. Mass.:44789.51
Organism:Homo sapiens (Human)
Description:P35372
Residue:400
BDBM50399662
NameBDBM50399662
Synonyms:CHEMBL2178338
TypeSmall organic molecule
Emp. Form.C27H31N3O5
Mol. Mass.477.5521
SMILESCOc1cc(ccn1)C(=O)N[C@@H]1CC[C@@]2(O)[C@H]3Cc4ccc(O)c5O[C@@H]1[C@]2(CCN3CC1CC1)c45