Reaction Details
TargetHistone deacetylase 8
LigandBDBM50399675
Substrate/Competitorn/a
Meas. Tech.ChEMBL_878900 (CHEMBL2185051)
IC50 350±n/a nM
Citation Suzuki, TOta, YRi, MBando, MGotoh, AItoh, YTsumoto, HTatum, PRMizukami, TNakagawa, HIida, SUeda, RShirahige, KMiyata, N Rapid discovery of highly potent and selective inhibitors of histone deacetylase 8 using click chemistry to generate candidate libraries. J Med Chem55:9562-75 (2012) 
 
Histone deacetylase 8
Name:Histone deacetylase 8
Type:Enzyme
Mol. Mass.:41749.60
Organism:Homo sapiens (Human)
Description:Q9BY41
Residue:377
BDBM50399675
NameBDBM50399675
Synonyms:CHEMBL2178345
TypeSmall organic molecule
Emp. Form.C16H14N4O2
Mol. Mass.294.308
SMILESONC(=O)c1cccc(c1)-c1cn(Cc2ccccc2)nn1