Reaction Details
TargetHistone deacetylase 8
LigandBDBM50397360
Substrate/Competitorn/a
Meas. Tech.ChEMBL_878900 (CHEMBL2185051)
IC50 310±n/a nM
Citation Suzuki, TOta, YRi, MBando, MGotoh, AItoh, YTsumoto, HTatum, PRMizukami, TNakagawa, HIida, SUeda, RShirahige, KMiyata, N Rapid discovery of highly potent and selective inhibitors of histone deacetylase 8 using click chemistry to generate candidate libraries. J Med Chem55:9562-75 (2012) 
 
Histone deacetylase 8
Name:Histone deacetylase 8
Type:Enzyme
Mol. Mass.:41749.60
Organism:Homo sapiens (Human)
Description:Q9BY41
Residue:377
BDBM50397360
NameBDBM50397360
Synonyms:CHEMBL2170177 | US10188756, Compound CN110
TypeSmall organic molecule
Emp. Form.C17H16N2O3
Mol. Mass.296.3205
SMILESCOc1ccc(Cn2ccc3ccc(cc23)C(=O)NO)cc1