Reaction Details
TargetHistone deacetylase 1
LigandBDBM50397360
Substrate/Competitorn/a
Meas. Tech.ChEMBL_878902 (CHEMBL2185053)
IC50>100000±n/a nM
Citation Suzuki, TOta, YRi, MBando, MGotoh, AItoh, YTsumoto, HTatum, PRMizukami, TNakagawa, HIida, SUeda, RShirahige, KMiyata, N Rapid discovery of highly potent and selective inhibitors of histone deacetylase 8 using click chemistry to generate candidate libraries. J Med Chem55:9562-75 (2012) 
 
Histone deacetylase 1
Name:Histone deacetylase 1
Type:Enzyme
Mol. Mass.:55090.27
Organism:Homo sapiens (Human)
Description:Q13547
Residue:482
BDBM50397360
NameBDBM50397360
Synonyms:CHEMBL2170177 | US10188756, Compound CN110
TypeSmall organic molecule
Emp. Form.C17H16N2O3
Mol. Mass.296.3205
SMILESCOc1ccc(Cn2ccc3ccc(cc23)C(=O)NO)cc1