Reaction Details
TargetMitogen-activated protein kinase 12
LigandBDBM50399676
Substrate/Competitorn/a
Meas. Tech.ChEMBL_876547 (CHEMBL2188504)
IC50>10000±n/a nM
Citation Yang, JWang, LJLiu, JJZhong, LZheng, RLXu, YJi, PZhang, CHWang, WJLin, XDLi, LLWei, YQYang, SY Structural optimization and structure-activity relationships of N2-(4-(4-Methylpiperazin-1-yl)phenyl)-N8-phenyl-9H-purine-2,8-diamine derivatives, a new class of reversible kinase inhibitors targeting both EGFR-activating and resistance mutations. J Med Chem55:10685-99 (2012) 
 
Mitogen-activated protein kinase 12
Name:Mitogen-activated protein kinase 12
Type:Protein
Mol. Mass.:41938.69
Organism:Homo sapiens (Human)
Description:P53778
Residue:367
BDBM50399676
NameBDBM50399676
Synonyms:CHEMBL2178352 | US9096601, 8-26
TypeSmall organic molecule
Emp. Form.C27H32N8
Mol. Mass.468.5966
SMILESCN1CCN(CC1)c1ccc(Nc2ncc3nc(Nc4ccccc4)n(C4CCCC4)c3n2)cc1