Reaction Details
TargetInterleukin-1 receptor-associated kinase 4
LigandBDBM50399676
Substrate/Competitorn/a
Meas. Tech.ChEMBL_876569 (CHEMBL2188526)
IC50>10000±n/a nM
Citation Yang, JWang, LJLiu, JJZhong, LZheng, RLXu, YJi, PZhang, CHWang, WJLin, XDLi, LLWei, YQYang, SY Structural optimization and structure-activity relationships of N2-(4-(4-Methylpiperazin-1-yl)phenyl)-N8-phenyl-9H-purine-2,8-diamine derivatives, a new class of reversible kinase inhibitors targeting both EGFR-activating and resistance mutations. J Med Chem55:10685-99 (2012) 
 
Interleukin-1 receptor-associated kinase 4
Name:Interleukin-1 receptor-associated kinase 4
Type:Protein
Mol. Mass.:51519.08
Organism:Homo sapiens (Human)
Description:Q9NWZ3
Residue:460
BDBM50399676
NameBDBM50399676
Synonyms:CHEMBL2178352 | US9096601, 8-26
TypeSmall organic molecule
Emp. Form.C27H32N8
Mol. Mass.468.5966
SMILESCN1CCN(CC1)c1ccc(Nc2ncc3nc(Nc4ccccc4)n(C4CCCC4)c3n2)cc1