Reaction Details
TargetDiacylglycerol O-acyltransferase 1
LigandBDBM50399686
Substrate/Competitorn/a
Meas. Tech.ChEMBL_876789 (CHEMBL2183606)
IC50 60±n/a nM
Citation Barlind, JGBauer, UABirch, AMBirtles, SBuckett, LKButlin, RJDavies, RDEriksson, JWHammond, CDHovland, RJohannesson, PJohansson, MJKemmitt, PDLindmark, BTMorentin Gutierrez, PNoeske, TANordin, AO'Donnell, CJPetersson, AURedzic, ATurnbull, AVVinblad, J Design and optimization of pyrazinecarboxamide-based inhibitors of diacylglycerol acyltransferase 1 (DGAT1) leading to a clinical candidate dimethylpyrazinecarboxamide phenylcyclohexylacetic acid (AZD7687). J Med Chem55:10610-29 (2012) 
 
Diacylglycerol O-acyltransferase 1
Name:Diacylglycerol O-acyltransferase 1
Type:Protein
Mol. Mass.:55297.82
Organism:Homo sapiens (Human)
Description:O75907
Residue:488
BDBM50399686
NameBDBM50399686
Synonyms:CHEMBL2178942
TypeSmall organic molecule
Emp. Form.C21H24FN3O3
Mol. Mass.385.432
SMILESCc1nc(C)c(nc1C(N)=O)-c1ccc([C@H]2CC[C@H](CC(O)=O)CC2)c(F)c1