Reaction Details
TargetNeuronal acetylcholine receptor subunit alpha-4/beta-2
LigandBDBM50399780
Substrate/Competitorn/a
Meas. Tech.ChEMBL_877366 (CHEMBL2182411)
Ki 200±n/a nM
Citation Mazurov, AAKombo, DCHauser, TAMiao, LDull, GGenus, JFFedorov, NBBenson, LSidach, SXiao, YHammond, PSJames, JWMiller, CHYohannes, D Discovery of (2S,3R)-N-[2-(Pyridin-3-ylmethyl)-1-azabicyclo[2.2.2]oct-3-yl]benzo[b]furan-2-carboxamide (TC-5619), a selectivea7 nicotinic acetylcholine receptor agonist, for the treatment of cognitive disorders. J Med Chem55:9793-809 (2012) 
 
Neuronal acetylcholine receptor subunit alpha-4/beta-2
Name:Neuronal acetylcholine receptor subunit alpha-4/beta-2
Type:Protein
Mol. Mass.:n/a
Description:n/a
Components:This complex has 2 components.
Component 1
Name:Neuronal acetylcholine receptor subunit alpha-4
Synonyms:ACHA4_HUMAN CHRNA4 protein Neuronal acetylcholine receptor protein alpha-4 subunit Nicotinic acetylcholine receptor alpha4/beta2/alpha5
Type:n/a
Mol. Mass.:69963.49
Organism:Homo sapiens (Human)
Description:NACHRA4
Residue:627
Component 2
Name:Neuronal acetylcholine receptor subunit beta-2
Synonyms:ACHB2_HUMAN Neuronal acetylcholine receptor protein beta-2 subunit | Nicotinic acetylcholine receptor alpha3/beta2/alpha5
Type:Protein
Mol. Mass.:57020.50
Organism:Homo sapiens (Human)
Description:P17787
Residue:502
BDBM50399780
NameBDBM50399780
Synonyms:CHEMBL2179874
TypeSmall organic molecule
Emp. Form.C18H20IN3OS
Mol. Mass.453.34
SMILESIc1ccc(s1)C(=O)N[C@@H]1C2CCN(CC2)[C@H]1Cc1cccnc1