Reaction Details
TargetNeuronal acetylcholine receptor subunit alpha-7
LigandBDBM50173952
Substrate/Competitorn/a
Meas. Tech.ChEMBL_877370 (CHEMBL2182415)
Ki 14.6±n/a nM
Citation Mazurov, AAKombo, DCHauser, TAMiao, LDull, GGenus, JFFedorov, NBBenson, LSidach, SXiao, YHammond, PSJames, JWMiller, CHYohannes, D Discovery of (2S,3R)-N-[2-(Pyridin-3-ylmethyl)-1-azabicyclo[2.2.2]oct-3-yl]benzo[b]furan-2-carboxamide (TC-5619), a selectivea7 nicotinic acetylcholine receptor agonist, for the treatment of cognitive disorders. J Med Chem55:9793-809 (2012) 
 
Neuronal acetylcholine receptor subunit alpha-7
Name:Neuronal acetylcholine receptor subunit alpha-7
Type:n/a
Mol. Mass.:56448.33
Organism:Homo sapiens (Human)
Description: CHRNA7 (NACHRA7)
Residue:502
BDBM50173952
NameBDBM50173952
Synonyms:Benzo[b]thiophene-2-carboxylic acid (1-aza-bicyclo[2.2.2]oct-3-yl)-amide | CHEMBL365323
TypeSmall organic molecule
Emp. Form.C16H18N2OS
Mol. Mass.286.392
SMILESO=C(NC1CN2CCC1CC2)c1cc2ccccc2s1