Reaction Details
TargetNeuronal acetylcholine receptor subunit alpha-7
LigandBDBM50399792
Substrate/Competitorn/a
Meas. Tech.ChEMBL_877370 (CHEMBL2182415)
Ki 2.8±n/a nM
Citation Mazurov, AAKombo, DCHauser, TAMiao, LDull, GGenus, JFFedorov, NBBenson, LSidach, SXiao, YHammond, PSJames, JWMiller, CHYohannes, D Discovery of (2S,3R)-N-[2-(Pyridin-3-ylmethyl)-1-azabicyclo[2.2.2]oct-3-yl]benzo[b]furan-2-carboxamide (TC-5619), a selectivea7 nicotinic acetylcholine receptor agonist, for the treatment of cognitive disorders. J Med Chem55:9793-809 (2012) 
 
Neuronal acetylcholine receptor subunit alpha-7
Name:Neuronal acetylcholine receptor subunit alpha-7
Type:n/a
Mol. Mass.:56448.33
Organism:Homo sapiens (Human)
Description: CHRNA7 (NACHRA7)
Residue:502
BDBM50399792
NameBDBM50399792
Synonyms:CHEMBL2179862
TypeSmall organic molecule
Emp. Form.C23H24N4O
Mol. Mass.372.4629
SMILESO=C(N[C@@H]1C2CCN(CC2)[C@H]1Cc1cccnc1)c1cc2ccccc2cn1