Reaction Details
TargetD(2) dopamine receptor
LigandBDBM50399881
Substrate/Competitorn/a
Meas. Tech.ChEMBL_877402 (CHEMBL2182832)
Ki 450±n/a nM
Citation Spetea, MBerzetei-Gurske, IPGuerrieri, ESchmidhammer, H Discovery and pharmacological evaluation of a diphenethylamine derivative (HS665), a highly potent and selective¿ opioid receptor agonist. J Med Chem55:10302-6 (2012) 
 
D(2) dopamine receptor
Name:D(2) dopamine receptor
Type:Cell-surface receptors
Mol. Mass.:50647.10
Organism:Homo sapiens (Human)
Description:P14416
Residue:443
BDBM50399881
NameBDBM50399881
Synonyms:CHEMBL2180639
TypeSmall organic molecule
Emp. Form.C21H27NO
Mol. Mass.309.4452
SMILESOc1cccc(CCN(CCc2ccccc2)CC2CCC2)c1