Reaction Details
TargetKappa-type opioid receptor
LigandBDBM50000296
Substrate/Competitorn/a
Meas. Tech.ChEMBL_877407 (CHEMBL2182837)
EC50 9.3±n/a nM
Citation Spetea, MBerzetei-Gurske, IPGuerrieri, ESchmidhammer, H Discovery and pharmacological evaluation of a diphenethylamine derivative (HS665), a highly potent and selective¿ opioid receptor agonist. J Med Chem55:10302-6 (2012) 
 
Kappa-type opioid receptor
Name:Kappa-type opioid receptor
Type:G Protein-Coupled Receptor (GPCR)
Mol. Mass.:42648.76
Organism:Homo sapiens (Human)
Description:P41145
Residue:380
BDBM50000296
NameBDBM50000296
Synonyms:CHEMBL441765 U-50488H | US11492374, ID 1
TypeSmall organic molecule
Emp. Form.C19H26Cl2N2O
Mol. Mass.369.329
SMILESCN([C@@H]1CCCC[C@H]1N1CCCC1)C(=O)Cc1ccc(Cl)c(Cl)c1