Reaction Details
TargetD(1A) dopamine receptor
LigandBDBM50399885
Substrate/Competitorn/a
Meas. Tech.ChEMBL_877404 (CHEMBL2182834)
Ki>10000±n/a nM
Citation Spetea, MBerzetei-Gurske, IPGuerrieri, ESchmidhammer, H Discovery and pharmacological evaluation of a diphenethylamine derivative (HS665), a highly potent and selective¿ opioid receptor agonist. J Med Chem55:10302-6 (2012) 
 
D(1A) dopamine receptor
Name:D(1A) dopamine receptor
Type:Enzyme
Mol. Mass.:49303.43
Organism:Homo sapiens (Human)
Description:P21728
Residue:446
BDBM50399885
NameBDBM50399885
Synonyms:CHEMBL2180640
TypeSmall organic molecule
Emp. Form.C20H27NO
Mol. Mass.297.4345
SMILESCCCCN(CCc1ccccc1)CCc1cccc(O)c1