Reaction Details
TargetcGMP-specific 3',5'-cyclic phosphodiesterase
LigandBDBM50399909
Substrate/Competitorn/a
Meas. Tech.ChEMBL_877577 (CHEMBL2184512)
IC50 1.6±n/a nM
Citation Wang, GLiu, ZChen, TWang, ZYang, HZheng, MRen, JTian, GYang, XLi, LLi, JSuo, JZhang, RJiang, XTerrett, NKShen, JXu, YJiang, H Design, synthesis, and pharmacological evaluation of monocyclic pyrimidinones as novel inhibitors of PDE5. J Med Chem55:10540-50 (2012) 
 
cGMP-specific 3',5'-cyclic phosphodiesterase
Name:cGMP-specific 3',5'-cyclic phosphodiesterase
Type:Protein
Mol. Mass.:99975.83
Organism:Homo sapiens (Human)
Description:O76074
Residue:875
BDBM50399909
NameBDBM50399909
Synonyms:CHEMBL2180945
TypeSmall organic molecule
Emp. Form.C22H32N4O4S
Mol. Mass.448.579
SMILESCCCOc1ccc(cc1-c1nc(CC)c(CC)c(=O)[nH]1)S(=O)(=O)N1CCN(C)CC1