Reaction Details
TargetIntegrin alpha-V/beta-3
LigandBDBM50399922
Substrate/Competitorn/a
Meas. Tech.ChEMBL_877703 (CHEMBL2185914)
IC50 0.2±n/a nM
Citation Colombo, RMingozzi, MBelvisi, LArosio, DPiarulli, UCarenini, NPerego, PZaffaroni, NDe Cesare, MCastiglioni, VScanziani, EGennari, C Synthesis and biological evaluation (in vitro and in vivo) of cyclic arginine-glycine-aspartate (RGD) peptidomimetic-paclitaxel conjugates targeting integrinaVß3. J Med Chem55:10460-74 (2012) 
 
Integrin alpha-V/beta-3
Name:Integrin alpha-V/beta-3
Type:Enzyme
Mol. Mass.:n/a
Description:n/a
Components:This complex has 2 components.
Component 1
Name:Integrin alpha-V
Synonyms:ITAV_HUMAN Integrin alpha-V/alpha-5 VNRA Vitronectin receptor | Vitronectin receptor subunit alpha
Type:PROTEIN
Mol. Mass.:116024.92
Organism:Homo sapiens (Human)
Description:ChEMBL_582336
Residue:1048
Component 2
Name:Integrin beta-3
Synonyms:CD_antigen=CD61 GPIIIa ITGB3 Platelet membrane glycoprotein IIIa
Type:Protein
Mol. Mass.:87038.91
Organism:Homo sapiens (Human)
Description:P05106
Residue:788
BDBM50399922
NameBDBM50399922
Synonyms:CHEMBL2180974
TypeSmall organic molecule
Emp. Form.C33H41N9O8
Mol. Mass.691.7341
SMILES[#7]\[#6](-[#7])=[#7]\[#6]-[#6]-[#6]-[#6@@H]-1-[#7]-[#6](=O)-[#6]-[#6@H]-2-[#7](-[#6]-c3ccccc3)-[#6](=O)-[#6@H](-[#6]-[#7]-[#6](=O)-[#6@H](-[#6]-[#6](-[#8])=O)-[#7]-[#6](=O)-[#6]-[#7]-[#6]-1=O)-[#7](-[#6]-c1ccccc1)-[#6]-2=O