Reaction Details
TargetAmine oxidase [flavin-containing] B
LigandBDBM50400109
Substrate/Competitorn/a
Meas. Tech.ChEMBL_878114 (CHEMBL2183304)
Ki 568±n/a nM
Citation Abdelhafez, OMAmin, KMAli, HIAbdalla, MMBatran, RZ Synthesis of new 7-oxycoumarin derivatives as potent and selective monoamine oxidase A inhibitors. J Med Chem55:10424-36 (2012) 
 
Amine oxidase [flavin-containing] B
Name:Amine oxidase [flavin-containing] B
Type:PROTEIN
Mol. Mass.:58428.94
Organism:Bos taurus
Description:ChEMBL_1501478
Residue:520
BDBM50400109
NameBDBM50400109
Synonyms:CHEMBL2178442
TypeSmall organic molecule
Emp. Form.C26H27ClN4O4S
Mol. Mass.527.035
SMILESCc1c(C)c(=O)oc2cc(OCc3nnc(SCCN4CCOCC4)n3-c3ccc(Cl)cc3)ccc12