Reaction Details
TargetAmine oxidase [flavin-containing] B
LigandBDBM50400130
Substrate/Competitorn/a
Meas. Tech.ChEMBL_878114 (CHEMBL2183304)
Ki 896±n/a nM
Citation Abdelhafez, OMAmin, KMAli, HIAbdalla, MMBatran, RZ Synthesis of new 7-oxycoumarin derivatives as potent and selective monoamine oxidase A inhibitors. J Med Chem55:10424-36 (2012) 
 
Amine oxidase [flavin-containing] B
Name:Amine oxidase [flavin-containing] B
Type:PROTEIN
Mol. Mass.:58428.94
Organism:Bos taurus
Description:ChEMBL_1501478
Residue:520
BDBM50400130
NameBDBM50400130
Synonyms:CHEMBL2178990
TypeSmall organic molecule
Emp. Form.C13H10N2O3S2
Mol. Mass.306.36
SMILESCc1cc(=O)oc2cc(OCc3nnc(S)s3)ccc12