Reaction Details
TargetAmine oxidase [flavin-containing] A
LigandBDBM50400111
Substrate/Competitorn/a
Meas. Tech.ChEMBL_878115 (CHEMBL2183305)
Ki 0.006±n/a nM
Citation Abdelhafez, OMAmin, KMAli, HIAbdalla, MMBatran, RZ Synthesis of new 7-oxycoumarin derivatives as potent and selective monoamine oxidase A inhibitors. J Med Chem55:10424-36 (2012) 
 
Amine oxidase [flavin-containing] A
Name:Amine oxidase [flavin-containing] A
Type:PROTEIN
Mol. Mass.:59764.63
Organism:Bos taurus
Description:ChEMBL_1501477
Residue:527
BDBM50400111
NameBDBM50400111
Synonyms:CHEMBL2178440
TypeSmall organic molecule
Emp. Form.C26H29ClN4O3S
Mol. Mass.513.051
SMILESCCN(CC)CCSc1nnc(COc2ccc3c(C)c(C)c(=O)oc3c2)n1-c1ccc(Cl)cc1