Reaction Details
TargetAmine oxidase [flavin-containing] A
LigandBDBM50400118
Substrate/Competitorn/a
Meas. Tech.ChEMBL_878115 (CHEMBL2183305)
Ki 0.006±n/a nM
Citation Abdelhafez, OMAmin, KMAli, HIAbdalla, MMBatran, RZ Synthesis of new 7-oxycoumarin derivatives as potent and selective monoamine oxidase A inhibitors. J Med Chem55:10424-36 (2012) 
 
Amine oxidase [flavin-containing] A
Name:Amine oxidase [flavin-containing] A
Type:PROTEIN
Mol. Mass.:59764.63
Organism:Bos taurus
Description:ChEMBL_1501477
Residue:527
BDBM50400118
NameBDBM50400118
Synonyms:CHEMBL2178433
TypeSmall organic molecule
Emp. Form.C19H14ClN3O3S
Mol. Mass.399.851
SMILESCc1cc(=O)oc2cc(OCc3nnc(Nc4ccc(Cl)cc4)s3)ccc12