Reaction Details
TargetAmine oxidase [flavin-containing] A
LigandBDBM50400128
Substrate/Competitorn/a
Meas. Tech.ChEMBL_878115 (CHEMBL2183305)
Ki 0.007±n/a nM
Citation Abdelhafez, OMAmin, KMAli, HIAbdalla, MMBatran, RZ Synthesis of new 7-oxycoumarin derivatives as potent and selective monoamine oxidase A inhibitors. J Med Chem55:10424-36 (2012) 
 
Amine oxidase [flavin-containing] A
Name:Amine oxidase [flavin-containing] A
Type:PROTEIN
Mol. Mass.:59764.63
Organism:Bos taurus
Description:ChEMBL_1501477
Residue:527
BDBM50400128
NameBDBM50400128
Synonyms:CHEMBL2178992
TypeSmall organic molecule
Emp. Form.C19H23N3O4S
Mol. Mass.389.469
SMILESCCN(CC)CCSc1nnc(COc2ccc3c(C)cc(=O)oc3c2)o1