Reaction Details
TargetAmine oxidase [flavin-containing] A
LigandBDBM50400133
Substrate/Competitorn/a
Meas. Tech.ChEMBL_878115 (CHEMBL2183305)
Ki 0.005±n/a nM
Citation Abdelhafez, OMAmin, KMAli, HIAbdalla, MMBatran, RZ Synthesis of new 7-oxycoumarin derivatives as potent and selective monoamine oxidase A inhibitors. J Med Chem55:10424-36 (2012) 
 
Amine oxidase [flavin-containing] A
Name:Amine oxidase [flavin-containing] A
Type:PROTEIN
Mol. Mass.:59764.63
Organism:Bos taurus
Description:ChEMBL_1501477
Residue:527
BDBM50400133
NameBDBM50400133
Synonyms:CHEMBL2178987
TypeSmall organic molecule
Emp. Form.C13H14N2O4
Mol. Mass.262.2613
SMILESCc1c(C)c(=O)oc2cc(OCC(=O)NN)ccc12