Reaction Details
Target11-beta-hydroxysteroid dehydrogenase 1
LigandBDBM50400148
Substrate/Competitorn/a
Meas. Tech.ChEMBL_878466 (CHEMBL2187380)
IC50 21±n/a nM
Citation Goldberg, FWLeach, AGScott, JSSnelson, WLGroombridge, SDDonald, CSBennett, SNBodin, CGutierrez, PMGyte, AC Free-Wilson and structural approaches to co-optimizing human and rodent isoform potency for 11ß-hydroxysteroid dehydrogenase type 1 (11ß-HSD1) inhibitors. J Med Chem55:10652-61 (2012) 
 
11-beta-hydroxysteroid dehydrogenase 1
Name:11-beta-hydroxysteroid dehydrogenase 1
Type:Enzyme
Mol. Mass.:32409.16
Organism:Homo sapiens (Human)
Description:P28845
Residue:292
BDBM50400148
NameBDBM50400148
Synonyms:CHEMBL2179457
TypeSmall organic molecule
Emp. Form.C24H34N4O3
Mol. Mass.426.5518
SMILESO[C@@]12CC3CC(C1)[C@H](NC(=O)c1cnc(N[C@@H]4CCOC4)nc1C1CCCC1)C(C3)C2