Reaction Details
Target17-beta-hydroxysteroid dehydrogenase type 1
LigandBDBM50400136
Substrate/Competitorn/a
Meas. Tech.ChEMBL_878460 (CHEMBL2187374)
IC50>35000±n/a nM
Citation Goldberg, FWLeach, AGScott, JSSnelson, WLGroombridge, SDDonald, CSBennett, SNBodin, CGutierrez, PMGyte, AC Free-Wilson and structural approaches to co-optimizing human and rodent isoform potency for 11ß-hydroxysteroid dehydrogenase type 1 (11ß-HSD1) inhibitors. J Med Chem55:10652-61 (2012) 
 
17-beta-hydroxysteroid dehydrogenase type 1
Name:17-beta-hydroxysteroid dehydrogenase type 1
Type:Enzyme
Mol. Mass.:34945.13
Organism:Homo sapiens (Human)
Description:P14061
Residue:328
BDBM50400136
NameBDBM50400136
Synonyms:CHEMBL2179452
TypeSmall organic molecule
Emp. Form.C24H34N4O3
Mol. Mass.426.5518
SMILESO[C@@]12CC3CC(C1)[C@H](NC(=O)c1cnc(NC4CCOCC4)nc1C1CCC1)C(C3)C2