Reaction Details
TargetInduced myeloid leukemia cell differentiation protein Mcl-1
LigandBDBM50400180
Substrate/Competitorn/a
Meas. Tech.ChEMBL_878601 (CHEMBL2188686)
Ki 13±n/a nM
Citation Zhang, ZLi, XSong, TZhao, YFeng, Y An anthraquinone scaffold for putative, two-face Bim BH3a-helix mimic. J Med Chem55:10735-41 (2012) 
 
Induced myeloid leukemia cell differentiation protein Mcl-1
Name:Induced myeloid leukemia cell differentiation protein Mcl-1
Type:Membrane; Single-pass membrane protein
Mol. Mass.:37332.87
Organism:Homo sapiens (Human)
Description:Q07820
Residue:350
BDBM50400180
NameBDBM50400180
Synonyms:2,3‐dihydroxy‐6‐[(4‐ isopropylphenyl)sulfanyl]anthracene‐9,10‐dione (Ligand 6) | CHEMBL2180320
TypeSmall organic molecule
Emp. Form.C23H18O4S
Mol. Mass.390.452
SMILESCC(C)c1ccc(Sc2ccc3C(=O)c4cc(O)c(O)cc4C(=O)c3c2)cc1