Reaction Details
TargetCathepsin E
LigandBDBM50400209
Substrate/Competitorn/a
Meas. Tech.ChEMBL_878949 (CHEMBL2185512)
IC50 58±n/a nM
Citation Liu, YZhang, WLi, LSalvador, LAChen, TChen, WFelsenstein, KMLadd, TBPrice, ARGolde, TEHe, JXu, YLi, YLuesch, H Cyanobacterial peptides as a prototype for the design of potentß-secretase inhibitors and the development of selective chemical probes for other aspartic proteases. J Med Chem55:10749-65 (2012) 
 
Cathepsin E
Name:Cathepsin E
Type:Enzyme
Mol. Mass.:43298.99
Organism:Homo sapiens (Human)
Description:P14091
Residue:396
BDBM50400209
NameBDBM50400209
Synonyms:CHEMBL2181023
TypeSmall organic molecule
Emp. Form.C47H70N8O10
Mol. Mass.907.1063
SMILESCOC(=O)[C@@H]1CCCN1C(=O)[C@@H](Cc1ccccc1)N(C)C(=O)[C@H](C)NC(=O)[C@H](CC(C)C)NC(=O)C[C@H](O)[C@H](Cc1ccccc1)NC(=O)[C@H](CCC(N)=O)N(C)C(=O)[C@@H](N)C(C)C