Reaction Details
TargetCathepsin D
LigandBDBM912
Substrate/Competitorn/a
Meas. Tech.ChEMBL_878950 (CHEMBL2185513)
IC50 0.693000±n/a nM
Citation Liu, YZhang, WLi, LSalvador, LAChen, TChen, WFelsenstein, KMLadd, TBPrice, ARGolde, TEHe, JXu, YLi, YLuesch, H Cyanobacterial peptides as a prototype for the design of potentß-secretase inhibitors and the development of selective chemical probes for other aspartic proteases. J Med Chem55:10749-65 (2012) 
 
Cathepsin D
Name:Cathepsin D
Type:Enzyme
Mol. Mass.:44551.72
Organism:Homo sapiens (Human)
Description:Human proCathepsin D (SwissProt accession number P07339) was expressed in Sf9 cells, purified, and autoactivated.
Residue:412
BDBM912
NameBDBM912
Synonyms:(3S,4S)-3-hydroxy-4-[(2S)-2-[(3S,4S)-3-hydroxy-6-methyl-4-[(2S)-3-methyl-2-[(2S)-3-methyl-2-(3-methylbutanamido)butanamido]butanamido]heptanamido]propanamido]-6-methylheptanoic acid Iva-Val-Val-Sta-Ala-Sta-OH PEPSTATIN US9115083, Pepstatin
TypeSmall organic molecule
Emp. Form.C34H63N5O9
Mol. Mass.685.8921
SMILESCC(C)C[C@H](NC(=O)[C@H](C)NC(=O)C[C@H](O)[C@H](CC(C)C)NC(=O)[C@@H](NC(=O)[C@@H](NC(=O)CC(C)C)C(C)C)C(C)C)[C@@H](O)CC(O)=O