Reaction Details
TargetComplement factor D
LigandBDBM50400275
Substrate/Competitorn/a
Meas. Tech.ChEMBL_872411 (CHEMBL2188699)
IC50 3±n/a nM
Citation Abdel-Magid, AF Factor D Inhibitors for the Treatment of AMD: Patent Highlight. ACS Med Chem Lett3:781-782 (2012) 
 
Complement factor D
Name:Complement factor D
Type:Protein
Mol. Mass.:27039.19
Organism:Homo sapiens (Human)
Description:P00746
Residue:253
BDBM50400275
NameBDBM50400275
Synonyms:CHEMBL2180766 | US9085555, 127
TypeSmall organic molecule
Emp. Form.C29H31ClFN5O5
Mol. Mass.584.038
SMILESCC(C)(C)OC(=O)Cc1ccc2c(NC(=O)N3[C@@H]4C[C@@H]4C[C@H]3C(=O)NCc3cccc(Cl)c3F)cn(C(N)=O)c2c1