Reaction Details
TargetNAD-dependent protein deacetylase sirtuin-2
LigandBDBM50400320
Substrate/Competitorn/a
Meas. Tech.ChEMBL_876635 (CHEMBL2182360)
IC50 24200±n/a nM
Citation Rotili, DTarantino, DNebbioso, APaolini, CHuidobro, CLara, EMellini, PLenoci, APezzi, RBotta, GLahtela-Kakkonen, MPoso, ASteinkühler, CGallinari, PDe Maria, RFraga, MEsteller, MAltucci, LMai, A Discovery of salermide-related sirtuin inhibitors: binding mode studies and antiproliferative effects in cancer cells including cancer stem cells. J Med Chem55:10937-47 (2012) 
 
NAD-dependent protein deacetylase sirtuin-2
Name:NAD-dependent protein deacetylase sirtuin-2
Type:Hydrolase
Mol. Mass.:43172.62
Organism:Homo sapiens (Human)
Description:n/a
Residue:389
BDBM50400320
NameBDBM50400320
Synonyms:CHEMBL2181509
TypeSmall organic molecule
Emp. Form.C26H23NO3S
Mol. Mass.429.531
SMILESCC(CS(=O)(=O)c1ccccc1\N=C\c1c(O)ccc2ccccc12)c1ccccc1