Reaction Details
TargetNAD-dependent protein deacetylase sirtuin-1
LigandBDBM50400322
Substrate/Competitorn/a
Meas. Tech.ChEMBL_876636 (CHEMBL2182361)
IC50 40300±n/a nM
Citation Rotili, DTarantino, DNebbioso, APaolini, CHuidobro, CLara, EMellini, PLenoci, APezzi, RBotta, GLahtela-Kakkonen, MPoso, ASteinkühler, CGallinari, PDe Maria, RFraga, MEsteller, MAltucci, LMai, A Discovery of salermide-related sirtuin inhibitors: binding mode studies and antiproliferative effects in cancer cells including cancer stem cells. J Med Chem55:10937-47 (2012) 
 
NAD-dependent protein deacetylase sirtuin-1
Name:NAD-dependent protein deacetylase sirtuin-1
Type:Developmental protein; hydrolase
Mol. Mass.:81626.66
Organism:Homo sapiens (Human)
Description:n/a
Residue:747
BDBM50400322
NameBDBM50400322
Synonyms:CHEMBL2181515
TypeSmall organic molecule
Emp. Form.C25H22N2O3S
Mol. Mass.430.519
SMILESCC(NS(=O)(=O)c1cccc(c1)\N=C\c1c(O)ccc2ccccc12)c1ccccc1