Reaction Details
TargetNAD-dependent protein deacetylase sirtuin-1
LigandBDBM50400323
Substrate/Competitorn/a
Meas. Tech.ChEMBL_876636 (CHEMBL2182361)
IC50 40300±n/a nM
Citation Rotili, DTarantino, DNebbioso, APaolini, CHuidobro, CLara, EMellini, PLenoci, APezzi, RBotta, GLahtela-Kakkonen, MPoso, ASteinkühler, CGallinari, PDe Maria, RFraga, MEsteller, MAltucci, LMai, A Discovery of salermide-related sirtuin inhibitors: binding mode studies and antiproliferative effects in cancer cells including cancer stem cells. J Med Chem55:10937-47 (2012) 
 
NAD-dependent protein deacetylase sirtuin-1
Name:NAD-dependent protein deacetylase sirtuin-1
Type:Developmental protein; hydrolase
Mol. Mass.:81626.66
Organism:Homo sapiens (Human)
Description:n/a
Residue:747
BDBM50400323
NameBDBM50400323
Synonyms:CHEMBL2181516
TypeSmall organic molecule
Emp. Form.C26H23NOS
Mol. Mass.397.532
SMILESCC(CSc1ccccc1\N=C\c1c(O)ccc2ccccc12)c1ccccc1